gradle build failed

 

 

 

 

After changes to source and building with gradle in Android Studio (I/O preview) AI - 130.677228 the build fails with the following error:Gradle: FAILURE: Build failed with an exception. Gradle: FAILURE: Build failed with an exception. What went wrong: Execution failed for task :compileDebugAidl. > No signature of method Based on the latest buildlog for Privacy Browser, it appears that the build server is missing the Android Gradle plugin 3.0.0. Could not find com.android.tools. build:gradle:3.0.0. Error:Execution failed for task :app:dexDebugin the individual module build.gradle files. classpath "com.newrelic.agent.

android:agent- gradle-plugin:4." After changes to source and building with gradle in Android Studio (I/O preview) AI - 130.677228 the build fails with the following error As my tests were failed due to dependency with Text NG, i tried adding testng(with different versions) related URL in the dependency section of build gradle, but the build always I am getting problem using gradle build system. When I tried fuse build -tandroid -DGRADLE.Normal build works just fine. But Gradle build fails. Fuse Team. This my build.gradle file.Error:Execution failed for task :app:prepareDebugAndroidTestDependencies. > Here is my Gradle Build output: Error:FAILURE: Build failed with an exception. What went wrong: Task compile is ambiguous in root project CBDashboard. Gradle build failing after update to 3.0.

Gradle 3.0.0-alpha1 isnt compatible with kotlin-android plugin 1.1.2-3? Gradle sync failed after switching to 3.0 canary 5. Опубликовано: 9 июн. 2017 г. Gradle build finished with errors.[FIXED] Gradle Sync Failed Error Android Studio 2.3.3 - Продолжительность: 6:19 Phenomenal School 27 518 просмотров. FAILURE: Build failed with an exception.Run with --info or --debug option to get more log output. BUILD FAILED. gradle HATA1. CommandInvokationFailure: Gradle build failed.FAILURE: Build failed with an exception. FAILURE: Build failed with an exception.Gradle would not actually use the string in such case, so the wrong string would not cause problem. FAILURE: Build failed with an exception. Where: Build file /Users/mrhaki/samples/ gradle/continue/build.gradle line: 4 . При запуске команды gradle setupDecompWorkspace, выдаёт ошибку!FAILURE: Build failed with an exception. Home. Internet Technology Gradle build error: Failed to resolveI just downloaded Android Studio and created a new project and Im getting gradle build errors FAILURE: Build failed with an exception. Where: Build file /Users/mrhaki/samples/ gradle/continue/build.gradle line: 4 . Build Failed : Gradle with uiautomator android. I had been trying to build my test project jar file using gradle instead of ant with uiautomator android but I am getting BUILD FAILED error. BUILD FAILED. Total time: 1.027 secs.Для этого gradle предлагает использовать конфигурацию с использованием settings. gradle. When I switch to gradle build it fails. I must be able to use a gradle build or else I will have to axe this plugin. The first error is: CommandInvokationFailure: Gradle build failed. 127 :app:mergeDebugResources FAILED FAILURE: Build failed with an exception.org.gradle.process.internal.ExecException: Process command /. However, when I try to run a gradle build on the build.gradle file in eclipse I get the following error: FAILURE: Build failed with an exception. Gradle: Execution failed for task :vertretungsplan:dexDebug. >You should go into your build.gradle file in your project, and look in your dependencies. org.gradle.configuration.

DefaultScriptPluginFactoryScriptPluginImpl2.run(DefaultScriptPluginFactory.java:209). FAILURE: Build failed with an exception. When Gradle is building a project then by default it will fail when any of build tasks fails. But sometimes we may want Gradle to continue build even with failed tests. FAILURE: Build failed with an exception.at org.gradle .api.internal.tasks.execution.ExecuteActionsTaskExecuter.execute Gradle jar - BUILD FAILED I have a project on groovy grails gradle. I want to compile it into jar file use: gradle jar in project dir, and have that problem: build.gradle apply plugin: java apply plugin Gradle sync failed: Android Gradle plugin 3.0.0-alpha5 must not be applied to project since version 3.0.0-alpha5 was already applied to this project. Expected Behavior. The app should build. When the gradlew build is executed it fails with giving below error log.2017-08-24T02:50:41.7890541Z Warning: Failed to read or create install properties file. classpath com.android.tools.build:gradle:3.0.1 . Note: For multi-module and composite builds, you may get a build error if the AndroidError:Failed to resolve: Could not resolve project :mylibrary. in the individual module build.gradle files . allprojects .delete rootProject.buildDir . build.gradle. apply plugin: com.android.application. Now the build fails with the following error: Failed to notify project evaluation listenerHeres my build.gradle: buildscript dependencies . Failed Unity Gradle Build. 2018-01-03 06:46 acl77 imported from Stackoverflow.When I select build and run it throws up the following exception I have been using android studio and there where 17 errors messages after gradle build finished.Error:failed linking file resources. Error:java.util.concurrent.ExecutionException Здравствуйте! Я подобрал для вас темы с ответами на вопрос Gradle build failed (Unity, Unity3D) Gradle: Execution failed for task :vertretungsplan:dexDebug. >Вы должны войти в свой файл build.gradle в свой проект и посмотреть в своих зависимостях. By default, the Gradle build process will be stopped and failed if any unit test is failed. gradle build : clean :compileJava :processResources :classes :compileTestJava :processTestResources FAILURE: Build failed with an exception.com.android.ide.common.process.ProcessException: org.gradle.process.internal.ExecException: Process command C:New folder FAILURE: Build failed with an exception.Could not resolve net.minecraftforge.gradle:ForgeGradle:2.2-SNAPSHOT. Failed to import new Gradle project: failed to find Build Tools revision .0.0. Google Play Services in an Android Studio 0.1.1 gradle project? Однако вы упоминаете Gradle 1.5, и это проблема. Версия плагина 0.3 была совместима с Gradle 1.3-1.4 Новый выпуск версии на прошлой неделе, 0,4 совместим с Gradle 1.6 . Gradle Build Failed. Started by Speaker Rob, November 8, 2017.Please post the output of the Gradle command. Now when I build any game for android it gives me: "Gradle build failed.Check the console for details". Tried reinstalling unity, SDK and JDK but same error. From the SDK manager, make sure you have both the Android Support Repository and Google Repository installed and up to date. android android-studio gradle android-gradle build.gradle.value 1 Information:BUILD FAILED Information:2 errors Information:Total time: 5.789 secs. Console log: FAILED FAILURE: Build failed with an exception.Gradle build fails with Can not run program No such file or directory. Error: Gradle: Execution failed for task :vertretungsplan:dexDebug. > Failed to run commandProject structure: build.gradle (actionbarsherlock) buildscript. Error:Execution failed for task :app:transformClassesWithDexForDebug.> com.android. build.api.transform.TransformExceptionHeres my build.gradle files. Gradle: Execution failed for task :vertretungsplan:dexDebug. >You should go into your build.gradle file in your project, and look in your dependencies.

new posts